{"text_format":"1","workbook":"xlsx","n_sheets":28,"sheets":["Veiledning","Registrering","Budsjett","Finansiering","Leiested","Tabeller","Intern oversikt","Oppsummering til videre bruk","Budget for the contract","Instructions","BE list","WP list","BE-WP Tmpl","Lump sum breakdown","Budget for proposal","Budget for proposal tmpl","Proposal BudgetIA Tmpl","Proposal Budget (RIA-CSA)","Proposal Budget (IA)","Person-months overview tpl","Person-months overview","Summary per WP","Summary per WP tmpl","BE Template","BE1","Depreciation costs","Any comments","CountryList"],"not_rendered":{"charts":0,"images":3,"macros":1,"external_links":1,"defined_names":24,"comments":3,"pivot_tables":0},"unopened":[],"bounds":{"document_bytes":16777216,"sheet_cells":100000,"rows_first":2000,"rows_last":500,"rows_between":2000,"halvings":0,"cell_chars":16384,"cell_head_chars":4096},"cells_cut":0,"cells_raw":0,"read":"whole","date_system":"1900"}

{"sheet":"Veiledning","index":0,"n_rows":0,"n_cols":0,"rows_kept":0,"cut":false,"hidden":false,"merged":[]}

{"sheet":"Registrering","index":1,"n_rows":29,"n_cols":11,"rows_kept":29,"cut":false,"hidden":false,"merged":[[9,1,13,1],[9,2,13,2]]}
[null,"Søknadsbudsjetteringsmal"]
[]
[null,"Prosjektinformasjon"]
[null,"Prosjekttittel*"]
[null,"Prosjektleder*"]
[null,"Prosjekteier (institutt mv)*"]
{"$rows_left_out":24}
{"sheet":"Budsjett","index":2,"n_rows":66,"n_cols":96,"rows_kept":66,"cut":false,"hidden":false,"merged":[]}
["Prosjekttittel:",null,null,{"$f":"IF(Registrering!$C$4=\"\",\"\",Registrering!$C$4)","v":""},null,null,null,null,null,null,null,null,null,null,null,null,null,null,null,null,null,null,null,null,null,null,null,null,null,null,null,null,null,null,null,null,null,null,null,null,"LØNNS- OG DRIFTSKOSTNADER",null,null,null,null,null,null,"OVERHEADKOSTNADER",null,null,null,null,null,null,null,"Eksternt finansiert overhead",null,null,null,null,null,null,null,"Internt finansiert overhead",null,null,null,null,null,null,null,null,null,null,null,null,null,null,null,"EU",null,null,null,null,null,null,null,null,"Egenandel"]
["Prosjektansatte - dekkes av prosjektbevilgning",null,null,null,null,"REGISTRER MÅNEDSVERK",null," +",null,null,null,null,null,"Alle beløp er angitt i hele kroner",null,null,null,null,null,null,null,null,null,null,null,null,null,null,null,null,null,null,null,null,null,null,null,null,null,null,null,null,null,null,null,null,null,null,null,null,null,null,null,null,null,null,null,null,null,null,null,null,null,null,null,null,null,null,null,null,"Ekstern finansiering"]
["Prosjektansatte","Stillingskategori iht EU's terminologi","Finansiør","Årslønn","Navn","År 1","År 2","År 3","År 4","År 5","År 6","Sum årsv","Sum mndverk","Lønn og sos. kostnader","Overhead","Totalt",null,null,null,null,null,null,null,null,null,null,null,null,"Gj.snitt. Ltr","Bruttolønn","inkl lønnsv.","Lønn","Feriep","AGA","Pensjon","inkl sos.avg.","inkl. ind.kost.","Timesats",null,null,{"$f":"F3","v":"År 1"},"År 2","År 3","År 4","År 5","År 6",null,{"$f":"AO3","v":"År 1"},"År 2","År 3","År 4","År 5","År 6",null,null,{"$f":"AV3","v":"År 1"},"År 2","År 3","År 4","År 5","År 6",null,null,{"$f":"F3","v":"År 1"},"År 2","År 3","År 4","År 5","År 6",null,null,null,null,null,null,null,null,null,null,null,{"$f":"F3","v":"År 1"},"År 2","År 3","År 4","År 5","År 6","Sum årsv",null,null,{"$f":"F3","v":"År 1"},"År 2","År 3","År 4","År 5","År 6","Sum årsv"]
["Postdoktor / Forsker",{"$f":"VLOOKUP(A4,Tabeller!$W$15:$Z$25,4,FALSE)","v":"Junior scientist"},"EU",null,null,null,null,null,null,null,null,{"$f":"SUM(F4:K4)/12","v":0},{"$f":"L4*12","v":0},{"$f":"SUM(AO4:AT4)","v":0},{"$f":"IFERROR(SUM(AV4:BA4),0)","v":0},{"$f":"SUM(N4:O4)","v":0},null,null,null,null,null,null,null,null,null,null,null,null,{"$f":"D4","v":0},{"$f":"D4","v":0},{"$f":"AD4*Tabeller!$I$35","v":0},{"$f":"IF(AD4>0,(AE4-400)/52*47,0)","v":0},{"$f":"AF4*Tabeller!$H$24","v":0},{"$f":"SUM(AF4:AG4,AI4)*Tabeller!$H$25","v":0},{"$f":"AE4*Tabeller!$H$26","v":0},{"$f":"SUM(AF4:AI4)","v":0},{"$f":"AJ4+(Registrering!$E$27)","v":0},{"$f":"AK4/Tabeller!$H$3","v":0},null,null,{"$f":"((F4*Budsjett!$AJ4))/12","v":0},{"$f":"((G4*Budsjett!$AJ4)*(Tabeller!J$33))/12","v":0},{"$f":"((H4*Budsjett!$AJ4)*(Tabeller!K$33))/12","v":0},{"$f":"((I4*Budsjett!$AJ4)*(Tabeller!L$33))/12","v":0},{"$f":"((J4*Budsjett!$AJ4)*(Tabeller!M$33))/12","v":0},{"$f":"((K4*Budsjett!$AJ4)*(Tabeller!N$33))/12","v":0},null,{"$f":"IFERROR(AO4*Budsjett!$G$57,0)","v":0},{"$f":"IFERROR(AP4*Budsjett!$G$57,0)","v":0},{"$f":"IFERROR(AQ4*Budsjett!$G$57,0)","v":0},{"$f":"IFERROR(AR4*Budsjett!$G$57,0)","v":0},{"$f":"IFERROR(AS4*Budsjett!$G$57,0)","v":0},{"$f":"IFERROR(AT4*Budsjett!$G$57,0)","v":0},null,null,{"$f":"IFERROR(AO4*Budsjett!BD$58,0)","v":0},{"$f":"IFERROR(AP4*Budsjett!BE$58,0)","v":0},{"$f":"IFERROR(AQ4*Budsjett!BF$58,0)","v":0},{"$f":"IFERROR(AR4*Budsjett!BG$58,0)","v":0},{"$f":"IFERROR(AS4*Budsjett!BH$58,0)","v":0},{"$f":"IFERROR(AT4*Budsjett!BI$58,0)","v":0},null,null,{"$f":"AV4-BD4","v":0},0,0,0,0,0,null,"Totale kostnader",{"$f":"AO35+AO50+AV35","v":0},0,0,0,0,0,0,null,{"$f":"A4","v":"Postdoktor / Forsker"},{"$f":"IF($C4=$CB$1,AO4,0)","v":0},0,0,0,0,0,{"$f":"SUM(CC4:CH4)","v":0},null,{"$f":"A4","v":"Postdoktor / Forsker"},null,null,null,null,null,null,{"$f":"SUM(CL4:CQ4)","v":0}]
["Prosjektleder/adm.leder",{"$f":"VLOOKUP(A5,Tabeller!$W$15:$Z$25,4,FALSE)","v":"Senior scientist"},"EU",null,null,null,null,null,null,null,null,0,{"$f":"L5*12","v":0},{"$f":"SUM(AO5:AT5)","v":0},0,0,null,null,null,null,null,null,null,null,null,null,null,null,0,0,{"$f":"AD5*Tabeller!$I$35","v":0},{"$f":"IF(AD5>0,(AE5-400)/52*47,0)","v":0},{"$f":"AF5*Tabeller!$H$24","v":0},{"$f":"SUM(AF5:AG5,AI5)*Tabeller!$H$25","v":0},{"$f":"AE5*Tabeller!$H$26","v":0},{"$f":"SUM(AF5:AI5)","v":0},{"$f":"AJ5+(Registrering!$E$27)","v":0},{"$f":"AK5/Tabeller!$H$3","v":0},null,null,{"$f":"((F5*Budsjett!$AJ5))/12","v":0},{"$f":"((G5*Budsjett!$AJ5)*(Tabeller!J$33))/12","v":0},{"$f":"((H5*Budsjett!$AJ5)*(Tabeller!K$33))/12","v":0},{"$f":"((I5*Budsjett!$AJ5)*(Tabeller!L$33))/12","v":0},{"$f":"((J5*Budsjett!$AJ5)*(Tabeller!M$33))/12","v":0},{"$f":"((K5*Budsjett!$AJ5)*(Tabeller!N$33))/12","v":0},null,{"$f":"IFERROR(AO5*Budsjett!$G$57,0)","v":0},{"$f":"IFERROR(AP5*Budsjett!$G$57,0)","v":0},{"$f":"IFERROR(AQ5*Budsjett!$G$57,0)","v":0},{"$f":"IFERROR(AR5*Budsjett!$G$57,0)","v":0},{"$f":"IFERROR(AS5*Budsjett!$G$57,0)","v":0},{"$f":"IFERROR(AT5*Budsjett!$G$57,0)","v":0},null,null,{"$f":"IFERROR(AO5*Budsjett!BD$58,0)","v":0},{"$f":"IFERROR(AP5*Budsjett!BE$58,0)","v":0},{"$f":"IFERROR(AQ5*Budsjett!BF$58,0)","v":0},{"$f":"IFERROR(AR5*Budsjett!BG$58,0)","v":0},{"$f":"IFERROR(AS5*Budsjett!BH$58,0)","v":0},{"$f":"IFERROR(AT5*Budsjett!BI$58,0)","v":0},null,null,0,0,0,0,0,0,null,"Fast beløp",{"$f":"Finansiering!C9","v":0},{"$f":"Finansiering!D9","v":0},{"$f":"Finansiering!E9","v":0},{"$f":"Finansiering!F9","v":0},{"$f":"Finansiering!G9","v":0},{"$f":"Finansiering!H9","v":0},{"$f":"Finansiering!I9","v":0},null,"Prosjektleder/adm.leder",0,0,0,0,0,0,0,null,"Prosjektleder/adm.leder",null,null,null,null,null,null,0]
["Prosjektleder/adm.leder",{"$f":"VLOOKUP(A6,Tabeller!$W$15:$Z$25,4,FALSE)","v":"Senior scientist"},"EU",null,null,null,null,null,null,null,null,0,0,0,{"$f":"IFERROR(SUM(AV6:BA6),0)","v":0},0,null,null,null,null,null,null,null,null,null,null,null,null,0,0,{"$f":"AD6*Tabeller!$I$35","v":0},0,{"$f":"AF6*Tabeller!$H$24","v":0},{"$f":"SUM(AF6:AG6,AI6)*Tabeller!$H$25","v":0},{"$f":"AE6*Tabeller!$H$26","v":0},0,{"$f":"AJ6+(Registrering!$E$27)","v":0},{"$f":"AK6/Tabeller!$H$3","v":0},null,null,{"$f":"((F6*Budsjett!$AJ6))/12","v":0},{"$f":"((G6*Budsjett!$AJ6)*(Tabeller!J$33))/12","v":0},{"$f":"((H6*Budsjett!$AJ6)*(Tabeller!K$33))/12","v":0},{"$f":"((I6*Budsjett!$AJ6)*(Tabeller!L$33))/12","v":0},{"$f":"((J6*Budsjett!$AJ6)*(Tabeller!M$33))/12","v":0},{"$f":"((K6*Budsjett!$AJ6)*(Tabeller!N$33))/12","v":0},null,{"$f":"IFERROR(AO6*Budsjett!$G$57,0)","v":0},{"$f":"IFERROR(AP6*Budsjett!$G$57,0)","v":0},{"$f":"IFERROR(AQ6*Budsjett!$G$57,0)","v":0},{"$f":"IFERROR(AR6*Budsjett!$G$57,0)","v":0},{"$f":"IFERROR(AS6*Budsjett!$G$57,0)","v":0},{"$f":"IFERROR(AT6*Budsjett!$G$57,0)","v":0},null,null,{"$f":"IFERROR(AO6*Budsjett!BD$58,0)","v":0},{"$f":"IFERROR(AP6*Budsjett!BE$58,0)","v":0},{"$f":"IFERROR(AQ6*Budsjett!BF$58,0)","v":0},{"$f":"IFERROR(AR6*Budsjett!BG$58,0)","v":0},{"$f":"IFERROR(AS6*Budsjett!BH$58,0)","v":0},{"$f":"IFERROR(AT6*Budsjett!BI$58,0)","v":0},null,null,0,0,0,0,0,0,null,"Sum Egenandel",{"$f":"-(AO28+BL35+CL41)","v":0},0,0,0,0,0,{"$f":"SUM(BT6:BY6)","v":0},null,"Prosjektleder/adm.leder",0,0,0,0,0,0,0,null,"Prosjektleder/adm.leder",null,null,null,null,null,null,0]
{"$rows_left_out":61}
{"sheet":"Finansiering","index":3,"n_rows":9,"n_cols":10,"rows_kept":9,"cut":false,"hidden":false,"merged":[]}
["Finansiering:"]
["Prosjekt:",{"$f":"IF(Registrering!C4=\"\",\"\",Registrering!C4)","v":""}]
[]
[]
["Fast eksternt beløp",null,"Legg inntekter inn med minus-fortegn"]
[null,"Navn",{"$f":"Budsjett!F3","v":"År 1"},{"$f":"Budsjett!G3","v":"År 2"},{"$f":"Budsjett!H3","v":"År 3"},{"$f":"Budsjett!I3","v":"År 4"},{"$f":"Budsjett!J3","v":"År 5"},{"$f":"Budsjett!K3","v":"År 6"},"Sum","% andel"]
{"$rows_left_out":4}
{"sheet":"Leiested","index":4,"n_rows":63,"n_cols":15,"rows_kept":63,"cut":false,"hidden":false,"merged":[]}
["Prosjekttittel:",null,{"$f":"IF(Registrering!C4=\"\",\"\",Registrering!C4)","v":""}]
["Leiestedskalkyle versjon:",null,null,null,"REGISTRER DRIFTSKOSTNADER",null,null,null,"Alle beløp angis i hele kroner"]
[null,"Finansiør",null,"Kommentarfelt",{"$f":"Budsjett!F3","v":"År 1"},{"$f":"Budsjett!G3","v":"År 2"},{"$f":"Budsjett!H3","v":"År 3"},{"$f":"Budsjett!I3","v":"År 4"},{"$f":"Budsjett!J3","v":"År 5"},{"$f":"Budsjett!K3","v":"År 6"},null,null,null,null,"Totalt"]
["Leiested 1",null,null,null,null,null,null,null,null,null,null,null,null,null,{"$f":"SUM(E4:N4)","v":0}]
["Antall timer/enheter Leiested","Egenandel"]
["Enhetspris Leiested","Egenandel"]
{"$rows_left_out":58}
{"sheet":"Tabeller","index":5,"n_rows":106,"n_cols":34,"rows_kept":106,"cut":false,"hidden":true,"merged":[]}
["Lønnstrinn",null,null,null,null,null,"PEDAT",null,null,null,null,null,null,null,null,null,null,null,null,null,null,null,null,null,null,null,null,null,null,null,null,null,"Grunnlagstabell for registrering av prosjektkategori"]
["Tabell mai 2022",null,"C-tabellen","    37,5 t."]
["LTR","Brutto",null,null,null,null,"Arbeidstimer pr. år",1720," Produktive timer"]
["Ltr.","Årslønn","Ltr.","Timelønn"]
[1,0,1,0,null,null,null,"Vit.ansatt","Adm. Ansatt",{"$f":"Budsjett!F3","v":"År 1"},{"$f":"Budsjett!G3","v":"År 2"},{"$f":"Budsjett!H3","v":"År 3"},{"$f":"Budsjett!I3","v":"År 4"},{"$f":"Budsjett!J3","v":"År 5"},{"$f":"Budsjett!K3","v":"År 6"},null,null,null,null,null,null,null," Satsene gjelder PR. ÅRSVERK"]
[2,0,2,0,null,null,"Prosjekter som foregår i UiOs lokaler",465000,142000,null,null,null,null,null,null,null,null,null,null,null,null,null," Mange typiske HumSam-miljøer",null,null,null,null,null,null,null,null,null,"Bevilgning"]
{"$rows_left_out":101}
{"sheet":"Intern oversikt","index":6,"n_rows":36,"n_cols":15,"rows_kept":36,"cut":false,"hidden":false,"merged":[[29,1,31,1],[29,2,31,11],[33,1,33,2],[33,4,33,10]]}
[null,"Grunnlag for UiO sine interne styring (totalregnskapsføring)"]
[]
[null,"Prosjekttittel:",{"$f":"IF(Registrering!$C$4=\"\",\"\",Registrering!$C$4)","v":""},null,null,null,null,null,"Startdato:",{"$f":"IF(Registrering!$C$18=\"\",\"na\",Registrering!$C$18)","v":"na"},null,"Dato:"]
[null,"Prosjektnr:",{"$f":"IF(Registrering!C8=\"\",\"na\",Registrering!C8)","v":"na"},null,null,null,null,null,"Sluttdato:",{"$f":"IF(Registrering!$C$19=\"\",\"na\",Registrering!$C$19)","v":"na"},null,{"$f":"IF(Registrering!C16=\"\",\"\",Registrering!C16)","v":""}]
[null,"Saksnummer ePhorte:",{"$f":"IF(Registrering!$C$9=\"\",\"na\",Registrering!$C$9)","v":"na"},null,null,null,null,null,"Prosjekttype (overheadkostnader):",{"$f":"Registrering!C27","v":0}]
[null,"Prosjektkategorisering:",{"$f":"Registrering!C24","v":0},null,null,null,null,"Finansieringstype:",null,{"$f":"Registrering!C26","v":"Fast beløp"},{"$f":"Registrering!C25","v":"Kostnadsspesifikk"}]
{"$rows_left_out":31}
{"sheet":"Oppsummering til videre bruk","index":7,"n_rows":41,"n_cols":4,"rows_kept":41,"cut":false,"hidden":false,"merged":[[2,0,2,3]]}
["COST CATEGORY","UNITS","COST PER UNIT","BE TOTAL COSTS"]
[]
["Oppsummert budsjettdata i EUs format"]
[]
["A. DIRECT PERSONNEL COSTS"]
["A.1 Employees (or equivalent)"]
{"$rows_left_out":36}
{"sheet":"Budget for the contract","index":8,"n_rows":36,"n_cols":12,"rows_kept":36,"cut":false,"hidden":true,"merged":[]}
["EU - Prosjektbudsjett (kontrakt)"]
[]
["EURO",9.9064999999999994]
[]
["Allocations sought from the EU Council (in EUR)"]
[]
{"$rows_left_out":31}
{"sheet":"Instructions","index":9,"n_rows":22,"n_cols":5,"rows_kept":22,"cut":false,"hidden":true,"merged":[[8,0,9,0],[21,1,21,3],[5,0,5,3],[12,0,17,0],[15,1,15,3],[16,1,16,3],[17,1,17,3],[19,1,19,3],[20,1,20,3],[10,1,10,3],[11,1,11,3],[12,1,12,3],[18,1,18,3],[13,1,13,3],[14,1,14,3],[8,1,9,3]]}
[]
[null,"Horizon Europe Programme"]
[]
[null,"Detailed lump sum budget",null,"Generate the Excel file in macro-free format \nReady for the online submission system"]
[]
["Instructions"]
{"$rows_left_out":17}
{"sheet":"BE list","index":10,"n_rows":4,"n_cols":12,"rows_kept":4,"cut":false,"hidden":true,"merged":[[1,0,1,4],[1,8,1,10]]}
[]
["List of beneficiaries and affiliated entities",null,null,null,null,null,null,"Add BE","! Double click buttons !",null,null,"Apply changes"]
["BE/AE nr","BE/AE name","Acronym","Country","Funding rate"]
["BE1","BE1 name","BE1 acronym","BE",1,null,null,null,null,"Add AE to BE1"]

{"sheet":"WP list","index":11,"n_rows":4,"n_cols":6,"rows_kept":4,"cut":false,"hidden":false,"merged":[[1,0,1,1]]}
[]
["List of Work Packages",null,null,"Add WP","! Double click buttons !","Apply changes"]
["WP number","WP name"]
["WP1","WP1 name"]

{"sheet":"BE-WP Tmpl","index":12,"n_rows":5,"n_cols":4,"rows_kept":5,"cut":false,"hidden":true,"merged":[[0,0,0,3]]}
["ESTIMATED BREAKDOWN OF THE LUMP SUM \nPER WORK PACKAGE AND PER BENEFICIARY"]
["BENEFICIARIES \\ WORK PACKAGES","WPx name","Totals","Pct %"]
["BEx: BEx name",null,null,{"$f":"IF(C$4>0,C3/C$4,\" \")","v":" "}]
["Totals: ",null,null,{"$f":"IF(C$4>0,C4/C$4,\" \")","v":" "}]
["Pct: ",{"$f":"IF($C4>0,B4/$C4,\" \")","v":" "},{"$f":"IF($C4>0,C4/$C4,\" \")","v":" "}]

{"sheet":"Lump sum breakdown","index":13,"n_rows":5,"n_cols":5,"rows_kept":5,"cut":false,"hidden":true,"merged":[[0,0,0,4]]}
["ESTIMATED BREAKDOWN OF THE LUMP SUM \nPER WORK PACKAGE AND PER BENEFICIARY"]
["BENEFICIARIES \\ WORK PACKAGES","WP1\r\nWP1 name","WP2\r\nNummer 2","Totals","Pct %"]
["BE1: BE1 name",{"$f":"'BE1'!D43*'BE list'!E4","v":0},{"$f":"'BE1'!D84*'BE list'!E4","v":0},{"$f":"SUM(B3:C3)","v":0},{"$f":"IF(D$4>0,D3/D$4,\" \")","v":" "}]
["Totals: ",{"$f":"SUM(B3)","v":0},{"$f":"SUM(C3)","v":0},{"$f":"SUM(B3:C3)","v":0},{"$f":"IF(D$4>0,D4/D$4,\" \")","v":" "}]
["Pct: ",{"$f":"IF($D4>0,B4/$D4,\" \")","v":" "},{"$f":"IF($D4>0,C4/$D4,\" \")","v":" "},{"$f":"IF($D4>0,D4/$D4,\" \")","v":" "}]

{"sheet":"Budget for proposal","index":14,"n_rows":5,"n_cols":4,"rows_kept":5,"cut":false,"hidden":true,"merged":[]}
["Budget (to be copied in the online submission form)"]
[]
["No","Name of Beneficiary","Country","Requested grant amount"]
["BE1","Beneficiary 1","BE",0]
["Totals: ",null,null,{"$f":"SUM(#REF!)","v":{"$error":"#REF!"}}]

{"sheet":"Budget for proposal tmpl","index":15,"n_rows":5,"n_cols":4,"rows_kept":5,"cut":false,"hidden":true,"merged":[]}
["Budget (to be copied in the online submission form)"]
[]
["No","Name of Beneficiary","Country","Requested grant amount"]
["BE1","Beneficiary 1","BE",0]
["Totals: ",null,null,{"$f":"SUM(#REF!)","v":{"$error":"#REF!"}}]

{"sheet":"Proposal BudgetIA Tmpl","index":16,"n_rows":6,"n_cols":18,"rows_kept":6,"cut":false,"hidden":true,"merged":[]}
["Budget for the proposal (IA)"]
[]
[null,null,null,"(A)","(B)","(C)","(D)","(E)","(F)","(G)","(H)","(I)","(J)","(K)","(L)","(M)","(N)","(O)"]
["No ","Participant","Country ","Direct personnel costs","Other direct costs","Direct costs of subcontracting","Direct costs of providing financial support to third parties","Costs of in kind contributions NOT used on the beneficiary's premises (included in A and B)","Indirect Costs (=0.25(A+B-E))","Special unit costs covering direct & indirect costs","Total estimated eligible costs (=A+B+C+D+F+G)","Reimbursement rate","Max. EU contribution \n(=H*I)","Costs of third parties linked to participant","Max. EU Contribution / € THIRD PARTIES","Total Costs for BENEFICIARY & THIRD PARTIES\n(=H+K)","Max. EU Contribution / €\nBENEFICIARY & THIRD PARTIES (=J+L)","Requested EU contribution / €\nBENEFICIARY & THIRD PARTIES"]
["BE1",null,null,{"$f":"SUM(#REF!:#REF!)","v":{"$error":"#REF!"}},{"$f":"SUM(#REF!:#REF!)","v":{"$error":"#REF!"}},{"$f":"SUM(#REF!:#REF!)","v":{"$error":"#REF!"}},{"$f":"SUM(#REF!:#REF!)","v":{"$error":"#REF!"}},{"$f":"SUM(#REF!:#REF!)","v":{"$error":"#REF!"}},{"$f":"#REF!","v":{"$error":"#REF!"}},null,{"$f":"#REF!","v":{"$error":"#REF!"}},null,{"$f":"$K5*$L5","v":{"$error":"#REF!"}}]
["Totals: ",null,null,{"$f":"SUM(D5:D5)","v":{"$error":"#REF!"}},{"$error":"#REF!"},{"$error":"#REF!"},{"$error":"#REF!"},{"$error":"#REF!"},{"$error":"#REF!"},0,{"$error":"#REF!"},null,{"$f":"SUM(M5:M5)","v":{"$error":"#REF!"}},0,0,0,0,0]
{"$rows_left_out":1}
{"sheet":"Proposal Budget (RIA-CSA)","index":17,"n_rows":6,"n_cols":14,"rows_kept":6,"cut":false,"hidden":true,"merged":[]}
["Budget for the proposal (RIA-CSA)"]
[]
[null,null,null,"(A)","(B)","(C)","(D)","(E)","(F)","(G)","(H)","(I)","(J)","(O)"]
["No ","Participant","Country ","Direct personnel costs","Other direct costs","Direct costs of subcontracting","Direct costs of providing financial support to third parties","Costs of in kind contributions NOT used on the beneficiary's premises (included in A and B)","Indirect Costs (=0.25(A+B-E))","Special unit costs covering direct & indirect costs","Total estimated eligible costs (=A+B+C+D+F+G)","Reimbursement rate","Max. EU contribution \n(=H*I)","Requested EU contribution / €\nBENEFICIARY & THIRD PARTIES"]
["BE1","Beneficiary 1","BE",{"$f":"SUM(#REF!:#REF!)","v":{"$error":"#REF!"}},{"$f":"SUM(#REF!:#REF!)","v":{"$error":"#REF!"}},{"$f":"SUM(#REF!:#REF!)","v":{"$error":"#REF!"}},{"$f":"SUM(#REF!:#REF!)","v":{"$error":"#REF!"}},{"$f":"SUM(#REF!:#REF!)","v":{"$error":"#REF!"}},{"$f":"SUM(#REF!:#REF!)","v":{"$error":"#REF!"}},null,{"$f":"SUM(#REF!:#REF!)","v":{"$error":"#REF!"}},1,{"$f":"$K5*$L5","v":{"$error":"#REF!"}}]
["Totals: ",null,null,{"$f":"SUM(D5)","v":{"$error":"#REF!"}},{"$error":"#REF!"},{"$error":"#REF!"},{"$error":"#REF!"},{"$error":"#REF!"},{"$error":"#REF!"},0,{"$error":"#REF!"},null,{"$f":"SUM(M5)","v":{"$error":"#REF!"}},{"$f":"SUM(N5)","v":0}]
{"$rows_left_out":1}
{"sheet":"Proposal Budget (IA)","index":18,"n_rows":6,"n_cols":18,"rows_kept":6,"cut":false,"hidden":true,"merged":[]}
["Budget for the proposal (IA)"]
[]
[null,null,null,"(A)","(B)","(C)","(D)","(E)","(F)","(G)","(H)","(I)","(J)","(K)","(L)","(M)","(N)","(O)"]
["No ","Participant","Country ","Direct personnel costs","Other direct costs","Direct costs of subcontracting","Direct costs of providing financial support to third parties","Costs of in kind contributions NOT used on the beneficiary's premises (included in A and B)","Indirect Costs (=0.25(A+B-E))","Special unit costs covering direct & indirect costs","Total estimated eligible costs (=A+B+C+D+F+G)","Reimbursement rate","Max. EU contribution \n(=H*I)","Costs of third parties linked to participant","Max. EU Contribution / € THIRD PARTIES","Total Costs for BENEFICIARY & THIRD PARTIES\n(=H+K)","Max. EU Contribution / €\nBENEFICIARY & THIRD PARTIES (=J+L)","Requested EU contribution / €\nBENEFICIARY & THIRD PARTIES"]
["BE1","Beneficiary 1","BE",{"$f":"SUM(#REF!:#REF!)","v":{"$error":"#REF!"}},{"$f":"SUM(#REF!:#REF!)","v":{"$error":"#REF!"}},{"$f":"SUM(#REF!:#REF!)","v":{"$error":"#REF!"}},{"$f":"SUM(#REF!:#REF!)","v":{"$error":"#REF!"}},{"$f":"SUM(#REF!:#REF!)","v":{"$error":"#REF!"}},{"$f":"SUM(#REF!:#REF!)","v":{"$error":"#REF!"}},null,{"$f":"SUM(#REF!:#REF!)","v":{"$error":"#REF!"}},{"$f":"'BE list'!E4","v":1},{"$f":"$K5*$L5","v":{"$error":"#REF!"}},null,null,{"$f":"K5+N5","v":{"$error":"#REF!"}},{"$f":"M5+O5","v":{"$error":"#REF!"}}]
["Totals: ",null,null,{"$f":"SUM(D5)","v":{"$error":"#REF!"}},{"$error":"#REF!"},{"$error":"#REF!"},{"$error":"#REF!"},{"$error":"#REF!"},{"$error":"#REF!"},0,{"$error":"#REF!"},null,{"$f":"SUM(M5)","v":{"$error":"#REF!"}},0,0,{"$error":"#REF!"},{"$error":"#REF!"},0]
{"$rows_left_out":1}
{"sheet":"Person-months overview tpl","index":19,"n_rows":5,"n_cols":4,"rows_kept":5,"cut":false,"hidden":true,"merged":[[0,0,0,3]]}
["TOTAL PERSON-MONTHS FOR ALL BENEFICIARIES \n(INCLUDING AFFILIATED ENTITIES) PER WP"]
["BENEFICIARIES \\ WORK PACKAGES","WP1","Total","Pct %"]
["BE1",null,{"$f":"SUM(B3:B3)","v":0},{"$f":"IF(C$4>0,C3/C$4,\" \")","v":" "}]
["Total",null,{"$f":"SUM(C3:C3)","v":0},{"$f":"IF(C$4>0,C4/C$4,\" \")","v":" "}]
["Percentage",{"$f":"IF($C4>0,B4/$C4,\" \")","v":" "},{"$f":"IF($C4>0,C4/$C4,\" \")","v":" "}]

{"sheet":"Person-months overview","index":20,"n_rows":5,"n_cols":5,"rows_kept":5,"cut":false,"hidden":true,"merged":[[0,0,0,4]]}
["TOTAL PERSON-MONTHS FOR ALL BENEFICIARIES \n(INCLUDING AFFILIATED ENTITIES) PER WP"]
["BENEFICIARIES \\ WORK PACKAGES","WP1\r\nWP1 name","WP2\r\nNummer 2","Total","Pct %"]
["BE1: BE1 name",{"$f":"(SUM('BE1'!$B9:'BE1'!$B16))","v":0},{"$f":"(SUM('BE1'!$B50:'BE1'!$B57))","v":0},{"$f":"SUM(B3:C3)","v":0},{"$f":"IF(D$4>0,D3/D$4,\" \")","v":" "}]
["Total",{"$f":"SUM(B3)","v":0},{"$f":"SUM(C3)","v":0},{"$f":"SUM(B3:C3)","v":0},{"$f":"IF(D$4>0,D4/D$4,\" \")","v":" "}]
["Percentage",{"$f":"IF($D4>0,B4/$D4,\" \")","v":" "},{"$f":"IF($D4>0,C4/$D4,\" \")","v":" "},{"$f":"IF($D4>0,D4/$D4,\" \")","v":" "}]

{"sheet":"Summary per WP","index":21,"n_rows":84,"n_cols":14,"rows_kept":84,"cut":false,"hidden":true,"merged":[[1,9,1,10],[4,0,4,13],[45,0,45,13],[1,1,1,3],[1,4,1,6]]}
["SUM OF ALL BENEFICIARIES (including AFFILIATED ENTITIES) FOR ALL THE WORK PACKAGES"]
[null,"ALL BENEFICIARIES \n(without affiliated entities)",null,null,"ALL AFFILIATED ENTITIES",null,null,null,null,"ALL BENEFICIARIES \n(with affiliated entities)"]
[" COST CATEGORY","UNITS","COST PER UNIT","BE TOTAL COSTS","UNITS","COST PER UNIT","AE TOTAL COSTS",null,null,"UNITS\n(TOTAL)","AVERAGE COST PER UNIT","BE+TP TOTAL COSTS",null,"TOTAL COSTS"]
[]
["COSTS WORK PACKAGE: 1      WP1 name"]
[]
{"$rows_left_out":79}
{"sheet":"Summary per WP tmpl","index":22,"n_rows":84,"n_cols":14,"rows_kept":84,"cut":false,"hidden":true,"merged":[[1,1,1,3],[1,4,1,6],[4,0,4,13],[45,0,45,13],[1,9,1,10]]}
["SUM OF ALL BENEFICIARIES (including AFFILIATED ENTITIES) FOR ALL THE WORK PACKAGES"]
[null,"ALL BENEFICIARIES \n(without affiliated entities)",null,null,"ALL AFFILIATED ENTITIES",null,null,null,null,"ALL BENEFICIARIES \n(with affiliated entities)"]
[" COST CATEGORY","UNITS","COST PER UNIT","BE TOTAL COSTS","UNITS","COST PER UNIT","AE TOTAL COSTS",null,null,"UNITS\n(TOTAL)","AVERAGE COST PER UNIT","BE+TP TOTAL COSTS",null,"TOTAL COSTS"]
[]
[]
[]
{"$rows_left_out":79}
{"sheet":"BE Template","index":23,"n_rows":84,"n_cols":9,"rows_kept":84,"cut":false,"hidden":true,"merged":[[1,1,1,3],[1,4,1,6],[4,0,4,8],[45,0,45,8],[0,4,0,6]]}
["BENEFICIARY x - CALCULATION SHEET",null,"View Summary",null,"Affiliated Entity n"]
[]
["COST CATEGORY","UNITS","COST PER UNIT","BE TOTAL COSTS","UNITS","COST PER UNIT","AE TOTAL COSTS",null,"BE+AE TOTAL COSTS"]
[]
["WORK PACKAGE"]
[]
{"$rows_left_out":79}
{"sheet":"BE1","index":24,"n_rows":84,"n_cols":4,"rows_kept":84,"cut":false,"hidden":false,"merged":[[45,0,45,3],[1,1,1,3],[4,0,4,3]]}
["BENEFICIARY 1 - CALCULATION SHEET",null,"View Summary"]
[null,"BE1 name"]
["COST CATEGORY","UNITS","COST PER UNIT","BE TOTAL COSTS"]
[]
[{"$f":"CONCATENATE(\"COSTS WORK PACKAGE 1: \",\"      \",\"WP1 name\")","v":"COSTS WORK PACKAGE 1:       WP1 name"}]
[]
{"$rows_left_out":79}
{"sheet":"Depreciation costs","index":25,"n_rows":209,"n_cols":12,"rows_kept":209,"cut":false,"hidden":true,"merged":[[0,0,0,11]]}
["TOOL:   DEPRECIATION COSTS LIST"]
["BE nr","Beneficiary name","WP nr","Work Package name","Resource type","Short name of the investments","Date of purchase (real or planned date of purchase)","Purchase cost","% used for the project","% of useful life of the equipment in the project","Charged \ndepreciation costs \nper investment","Justification: Needed info for depreciation"]
[null,null,null,null,null,null,null,null,null,null,{"$f":"+H3*I3*J3","v":0}]
[1,null,1,null,"Infrastructures",null,null,100000,0.5,0.5,25000]
[null,null,null,null,null,null,null,null,null,null,0]
[null,null,null,null,null,null,null,null,null,null,0]
{"$rows_left_out":204}
{"sheet":"Any comments","index":26,"n_rows":2,"n_cols":4,"rows_kept":2,"cut":false,"hidden":true,"merged":[[0,0,0,3]]}
["Any comments"]
["nr","BE ref","WP ref","Comments"]

{"sheet":"CountryList","index":27,"n_rows":164,"n_cols":2,"rows_kept":164,"cut":false,"hidden":true,"merged":[]}
["Country","Coefficient"]
["AE",0.94]
["AL",0.59]
["AM",0.77700000000000002]
["AO",1.3]
["AR",0.625]
{"$rows_left_out":158}