{"text_format":"1","workbook":"xlsx","n_sheets":2,"sheets":["Gantt Chart","Aktivitetsplan"],"not_rendered":{"charts":0,"images":3,"macros":1,"external_links":0,"defined_names":2,"comments":1,"pivot_tables":0},"unopened":[],"bounds":{"document_bytes":16777216,"sheet_cells":100000,"rows_first":2000,"rows_last":500,"rows_between":2000,"halvings":0,"cell_chars":16384,"cell_head_chars":4096},"cells_cut":0,"cells_raw":0,"read":"whole","date_system":"1900"}

{"sheet":"Gantt Chart","index":0,"n_rows":94,"n_cols":254,"rows_kept":94,"cut":false,"hidden":false,"merged":[[3,14,3,23],[5,54,5,58],[5,34,5,38],[5,39,5,43],[5,44,5,48],[5,49,5,53],[5,14,5,18],[5,19,5,23],[5,24,5,28],[5,29,5,33],[5,79,5,83],[5,84,5,88],[5,89,5,93],[5,94,5,98],[5,59,5,63],[5,64,5,68],[5,69,5,73],[5,74,5,78],[5,119,5,123],[5,124,5,128],[5,129,5,133],[5,134,5,138],[5,99,5,103],[5,104,5,108],[5,109,5,113],[5,114,5,118],[5,159,5,163],[5,164,5,168],[5,169,5,173],[5,174,5,178],[5,139,5,143],[5,144,5,148],[5,149,5,153],[5,154,5,158],[5,199,5,203],[5,204,5,208],[5,209,5,213],[5,214,5,218],[5,179,5,183],[5,184,5,188],[5,189,5,193],[5,194,5,198],[5,219,5,223],[5,244,5,248],[5,249,5,253],[5,224,5,228],[5,229,5,233],[5,234,5,238],[5,239,5,243]]}
[null,null,null,"Prosjekt:","Testprosjekt"]
[null,null,null,"Prosjekteier:","NN",null,"Startdato:","2016-04-11"]
[null,null,null,"Prosjektleder:","Arne And",null,"Totalbudsjett:"]
[null,null,null,"Dokumenteier:","NN",null,null,null,null,null,"Alternativ startdato:",null,null,null,"2016-04-11"]
[null,null,null,"Sist oppdatert:","30.02.2016",null,null,"      ",null,null,null,null,null,null,1,2,3,4,5,{"$f":"S5+3","v":8},{"$f":"T5+1","v":9},{"$f":"U5+1","v":10},{"$f":"V5+1","v":11},{"$f":"W5+1","v":12},{"$f":"X5+3","v":15},{"$f":"Y5+1","v":16},{"$f":"Z5+1","v":17},{"$f":"AA5+1","v":18},{"$f":"AB5+1","v":19},{"$f":"AC5+3","v":22},{"$f":"AD5+1","v":23},{"$f":"AE5+1","v":24},{"$f":"AF5+1","v":25},{"$f":"AG5+1","v":26},{"$f":"AH5+3","v":29},{"$f":"AI5+1","v":30},{"$f":"AJ5+1","v":31},{"$f":"AK5+1","v":32},{"$f":"AL5+1","v":33},{"$f":"AM5+3","v":36},{"$f":"AN5+1","v":37},{"$f":"AO5+1","v":38},{"$f":"AP5+1","v":39},{"$f":"AQ5+1","v":40},{"$f":"AR5+3","v":43},{"$f":"AS5+1","v":44},{"$f":"AT5+1","v":45},{"$f":"AU5+1","v":46},{"$f":"AV5+1","v":47},{"$f":"AW5+3","v":50},{"$f":"AX5+1","v":51},{"$f":"AY5+1","v":52},{"$f":"AZ5+1","v":53},{"$f":"BA5+1","v":54},{"$f":"BB5+3","v":57},{"$f":"BC5+1","v":58},{"$f":"BD5+1","v":59},{"$f":"BE5+1","v":60},{"$f":"BF5+1","v":61},{"$f":"BG5+3","v":64},{"$f":"BH5+1","v":65},{"$f":"BI5+1","v":66},{"$f":"BJ5+1","v":67},{"$f":"BK5+1","v":68},{"$f":"BL5+3","v":71},{"$f":"BM5+1","v":72},{"$f":"BN5+1","v":73},{"$f":"BO5+1","v":74},{"$f":"BP5+1","v":75},{"$f":"BQ5+3","v":78},{"$f":"BR5+1","v":79},{"$f":"BS5+1","v":80},{"$f":"BT5+1","v":81},{"$f":"BU5+1","v":82},{"$f":"BV5+3","v":85},{"$f":"BW5+1","v":86},{"$f":"BX5+1","v":87},{"$f":"BY5+1","v":88},{"$f":"BZ5+1","v":89},{"$f":"CA5+3","v":92},{"$f":"CB5+1","v":93},{"$f":"CC5+1","v":94},{"$f":"CD5+1","v":95},{"$f":"CE5+1","v":96},{"$f":"CF5+3","v":99},{"$f":"CG5+1","v":100},{"$f":"CH5+1","v":101},{"$f":"CI5+1","v":102},{"$f":"CJ5+1","v":103},{"$f":"CK5+3","v":106},{"$f":"CL5+1","v":107},{"$f":"CM5+1","v":108},{"$f":"CN5+1","v":109},{"$f":"CO5+1","v":110},{"$f":"CP5+3","v":113},{"$f":"CQ5+1","v":114},{"$f":"CR5+1","v":115},{"$f":"CS5+1","v":116},{"$f":"CT5+1","v":117},{"$f":"CU5+3","v":120},{"$f":"CV5+1","v":121},{"$f":"CW5+1","v":122},{"$f":"CX5+1","v":123},{"$f":"CY5+1","v":124},{"$f":"CZ5+3","v":127},{"$f":"DA5+1","v":128},{"$f":"DB5+1","v":129},{"$f":"DC5+1","v":130},{"$f":"DD5+1","v":131},{"$f":"DE5+3","v":134},{"$f":"DF5+1","v":135},{"$f":"DG5+1","v":136},{"$f":"DH5+1","v":137},{"$f":"DI5+1","v":138},{"$f":"DJ5+3","v":141},{"$f":"DK5+1","v":142},{"$f":"DL5+1","v":143},{"$f":"DM5+1","v":144},{"$f":"DN5+1","v":145},{"$f":"DO5+3","v":148},{"$f":"DP5+1","v":149},{"$f":"DQ5+1","v":150},{"$f":"DR5+1","v":151},{"$f":"DS5+1","v":152},{"$f":"DT5+3","v":155},{"$f":"DU5+1","v":156},{"$f":"DV5+1","v":157},{"$f":"DW5+1","v":158},{"$f":"DX5+1","v":159},{"$f":"DY5+3","v":162},{"$f":"DZ5+1","v":163},{"$f":"EA5+1","v":164},{"$f":"EB5+1","v":165},{"$f":"EC5+1","v":166},{"$f":"ED5+3","v":169},{"$f":"EE5+1","v":170},{"$f":"EF5+1","v":171},{"$f":"EG5+1","v":172},{"$f":"EH5+1","v":173},{"$f":"EI5+3","v":176},{"$f":"EJ5+1","v":177},{"$f":"EK5+1","v":178},{"$f":"EL5+1","v":179},{"$f":"EM5+1","v":180},{"$f":"EN5+3","v":183},{"$f":"EO5+1","v":184},{"$f":"EP5+1","v":185},{"$f":"EQ5+1","v":186},{"$f":"ER5+1","v":187},{"$f":"ES5+3","v":190},{"$f":"ET5+1","v":191},{"$f":"EU5+1","v":192},{"$f":"EV5+1","v":193},{"$f":"EW5+1","v":194},{"$f":"EX5+3","v":197},{"$f":"EY5+1","v":198},{"$f":"EZ5+1","v":199},{"$f":"FA5+1","v":200},{"$f":"FB5+1","v":201},{"$f":"FC5+3","v":204},{"$f":"FD5+1","v":205},{"$f":"FE5+1","v":206},{"$f":"FF5+1","v":207},{"$f":"FG5+1","v":208},{"$f":"FH5+3","v":211},{"$f":"FI5+1","v":212},{"$f":"FJ5+1","v":213},{"$f":"FK5+1","v":214},{"$f":"FL5+1","v":215},{"$f":"FM5+3","v":218},{"$f":"FN5+1","v":219},{"$f":"FO5+1","v":220},{"$f":"FP5+1","v":221},{"$f":"FQ5+1","v":222},{"$f":"FR5+3","v":225},{"$f":"FS5+1","v":226},{"$f":"FT5+1","v":227},{"$f":"FU5+1","v":228},{"$f":"FV5+1","v":229},{"$f":"FW5+3","v":232},{"$f":"FX5+1","v":233},{"$f":"FY5+1","v":234},{"$f":"FZ5+1","v":235},{"$f":"GA5+1","v":236},{"$f":"GB5+3","v":239},{"$f":"GC5+1","v":240},{"$f":"GD5+1","v":241},{"$f":"GE5+1","v":242},{"$f":"GF5+1","v":243},{"$f":"GG5+3","v":246},{"$f":"GH5+1","v":247},{"$f":"GI5+1","v":248},{"$f":"GJ5+1","v":249},{"$f":"GK5+1","v":250},{"$f":"GL5+3","v":253},{"$f":"GM5+1","v":254},{"$f":"GN5+1","v":255},{"$f":"GO5+1","v":256},{"$f":"GP5+1","v":257},{"$f":"GQ5+3","v":260},{"$f":"GR5+1","v":261},{"$f":"GS5+1","v":262},{"$f":"GT5+1","v":263},{"$f":"GU5+1","v":264},{"$f":"GV5+3","v":267},{"$f":"GW5+1","v":268},{"$f":"GX5+1","v":269},{"$f":"GY5+1","v":270},{"$f":"GZ5+1","v":271},{"$f":"HA5+3","v":274},{"$f":"HB5+1","v":275},{"$f":"HC5+1","v":276},{"$f":"HD5+1","v":277},{"$f":"HE5+1","v":278},{"$f":"HF5+3","v":281},{"$f":"HG5+1","v":282},{"$f":"HH5+1","v":283},{"$f":"HI5+1","v":284},{"$f":"HJ5+1","v":285},{"$f":"HK5+3","v":288},{"$f":"HL5+1","v":289},{"$f":"HM5+1","v":290},{"$f":"HN5+1","v":291},{"$f":"HO5+1","v":292},{"$f":"HP5+3","v":295},{"$f":"HQ5+1","v":296},{"$f":"HR5+1","v":297},{"$f":"HS5+1","v":298},{"$f":"HT5+1","v":299},{"$f":"HU5+3","v":302},{"$f":"HV5+1","v":303},{"$f":"HW5+1","v":304},{"$f":"HX5+1","v":305},{"$f":"HY5+1","v":306},{"$f":"HZ5+3","v":309},{"$f":"IA5+1","v":310},{"$f":"IB5+1","v":311},{"$f":"IC5+1","v":312},{"$f":"ID5+1","v":313},{"$f":"IE5+3","v":316},{"$f":"IF5+1","v":317},{"$f":"IG5+1","v":318},{"$f":"IH5+1","v":319},{"$f":"II5+1","v":320},{"$f":"IJ5+3","v":323},{"$f":"IK5+1","v":324},{"$f":"IL5+1","v":325},{"$f":"IM5+1","v":326},{"$f":"IN5+1","v":327},{"$f":"IO5+3","v":330},{"$f":"IP5+1","v":331},{"$f":"IQ5+1","v":332},{"$f":"IR5+1","v":333},{"$f":"IS5+1","v":334}]
["WBS",null,"AKTIVITET","Ressurs","Planlagt startdato","Planlagt ferdig dato","Faktisk ferdig dato","Status","Status farge","Estimerte timer","Faktiske timer","Cal Start","Cal End","Dager",{"$f":"IF(O4=\"\",H2,O4)","v":"2016-04-11"},null,null,null,null,{"$f":"O6+7","v":"2016-04-18"},null,null,null,null,{"$f":"T6+7","v":"2016-04-25"},null,null,null,null,{"$f":"Y6+7","v":"2016-05-02"},null,null,null,null,{"$f":"AD6+7","v":"2016-05-09"},null,null,null,null,{"$f":"AI6+7","v":"2016-05-16"},null,null,null,null,{"$f":"AN6+7","v":"2016-05-23"},null,null,null,null,{"$f":"AS6+7","v":"2016-05-30"},null,null,null,null,{"$f":"AX6+7","v":"2016-06-06"},null,null,null,null,{"$f":"BC6+7","v":"2016-06-13"},null,null,null,null,{"$f":"BH6+7","v":"2016-06-20"},null,null,null,null,{"$f":"BM6+7","v":"2016-06-27"},null,null,null,null,{"$f":"BR6+7","v":"2016-07-04"},null,null,null,null,{"$f":"BW6+7","v":"2016-07-11"},null,null,null,null,{"$f":"CB6+7","v":"2016-07-18"},null,null,null,null,{"$f":"CG6+7","v":"2016-07-25"},null,null,null,null,{"$f":"CL6+7","v":"2016-08-01"},null,null,null,null,{"$f":"CQ6+7","v":"2016-08-08"},null,null,null,null,{"$f":"CV6+7","v":"2016-08-15"},null,null,null,null,{"$f":"DA6+7","v":"2016-08-22"},null,null,null,null,{"$f":"DF6+7","v":"2016-08-29"},null,null,null,null,{"$f":"DK6+7","v":"2016-09-05"},null,null,null,null,{"$f":"DP6+7","v":"2016-09-12"},null,null,null,null,{"$f":"DU6+7","v":"2016-09-19"},null,null,null,null,{"$f":"DZ6+7","v":"2016-09-26"},null,null,null,null,{"$f":"EE6+7","v":"2016-10-03"},null,null,null,null,{"$f":"EJ6+7","v":"2016-10-10"},null,null,null,null,{"$f":"EO6+7","v":"2016-10-17"},null,null,null,null,{"$f":"ET6+7","v":"2016-10-24"},null,null,null,null,{"$f":"EY6+7","v":"2016-10-31"},null,null,null,null,{"$f":"FD6+7","v":"2016-11-07"},null,null,null,null,{"$f":"FI6+7","v":"2016-11-14"},null,null,null,null,{"$f":"FN6+7","v":"2016-11-21"},null,null,null,null,{"$f":"FS6+7","v":"2016-11-28"},null,null,null,null,{"$f":"FX6+7","v":"2016-12-05"},null,null,null,null,{"$f":"GC6+7","v":"2016-12-12"},null,null,null,null,{"$f":"GH6+7","v":"2016-12-19"},null,null,null,null,{"$f":"GM6+7","v":"2016-12-26"},null,null,null,null,{"$f":"GR6+7","v":"2017-01-02"},null,null,null,null,{"$f":"GW6+7","v":"2017-01-09"},null,null,null,null,{"$f":"HB6+7","v":"2017-01-16"},null,null,null,null,{"$f":"HG6+7","v":"2017-01-23"},null,null,null,null,{"$f":"HL6+7","v":"2017-01-30"},null,null,null,null,{"$f":"HQ6+7","v":"2017-02-06"},null,null,null,null,{"$f":"HV6+7","v":"2017-02-13"},null,null,null,null,{"$f":"IA6+7","v":"2017-02-20"},null,null,null,null,{"$f":"IF6+7","v":"2017-02-27"},null,null,null,null,{"$f":"IK6+7","v":"2017-03-06"}]
[1,null,"Milepæl - Villsvinkvoter",null,"2016-04-11","2016-12-31",{"$f":"MAX(G8:G17)","v":"00:00:00"},null,{"$f":"IF(H7=\"Ferdig\",\"GRØNN\",IF(H7=\"I henhold til plan\",\"GRØNN\",IF(H7=\"Forsinket - påvirker ikke leveranse\",\"GUL\",IF(H7=\"Forsinket - påvirker leveranse\",\"RØD\",\"  \"))))","v":"  "},{"$f":"VLOOKUP(A7,Aktivitetsplan!A:X,21,FALSE)","v":0},{"$f":"VLOOKUP(A7,Aktivitetsplan!A:X,22,FALSE)","v":0},{"$f":"MIN(L8:L17)","v":2},{"$f":"MAX(M8:M17)","v":193},{"$f":"SUM(O7:IT7)","v":138},{"$f":"IF(AND(O$5>=$L7,O$5<=$M7),1,\"\")","v":""},1,1,1,1,1,1,1,1,1,{"$f":"IF(AND(Y$5>=$L7,Y$5<=$M7),1,\"\")","v":1},1,1,1,1,1,1,1,1,1,{"$f":"IF(AND(AI$5>=$L7,AI$5<=$M7),1,\"\")","v":1},1,1,1,1,1,1,1,1,1,{"$f":"IF(AND(AS$5>=$L7,AS$5<=$M7),1,\"\")","v":1},1,1,1,1,1,1,1,1,1,{"$f":"IF(AND(BC$5>=$L7,BC$5<=$M7),1,\"\")","v":1},1,1,1,1,1,1,1,1,1,{"$f":"IF(AND(BM$5>=$L7,BM$5<=$M7),1,\"\")","v":1},1,1,1,1,1,1,1,1,1,{"$f":"IF(AND(BW$5>=$L7,BW$5<=$M7),1,\"\")","v":1},1,1,1,1,1,1,1,1,1,{"$f":"IF(AND(CG$5>=$L7,CG$5<=$M7),1,\"\")","v":1},1,1,1,1,1,1,1,1,1,{"$f":"IF(AND(CQ$5>=$L7,CQ$5<=$M7),1,\"\")","v":1},1,1,1,1,1,1,1,1,1,{"$f":"IF(AND(DA$5>=$L7,DA$5<=$M7),1,\"\")","v":1},1,1,1,1,1,1,1,1,1,{"$f":"IF(AND(DK$5>=$L7,DK$5<=$M7),1,\"\")","v":1},1,1,1,1,1,1,1,1,1,{"$f":"IF(AND(DU$5>=$L7,DU$5<=$M7),1,\"\")","v":1},1,1,1,1,1,1,1,1,1,{"$f":"IF(AND(EE$5>=$L7,EE$5<=$M7),1,\"\")","v":1},1,1,1,1,1,1,1,1,1,{"$f":"IF(AND(EO$5>=$L7,EO$5<=$M7),1,\"\")","v":1},1,1,1,1,1,1,1,1,"",{"$f":"IF(AND(EY$5>=$L7,EY$5<=$M7),1,\"\")","v":""},"","","","","","","","","",{"$f":"IF(AND(FI$5>=$L7,FI$5<=$M7),1,\"\")","v":""},"","","","","","","","","",{"$f":"IF(AND(FS$5>=$L7,FS$5<=$M7),1,\"\")","v":""},"","","","","","","","","",{"$f":"IF(AND(GC$5>=$L7,GC$5<=$M7),1,\"\")","v":""},"","","","","","","","","",{"$f":"IF(AND(GM$5>=$L7,GM$5<=$M7),1,\"\")","v":""},"","","","","","","","","",{"$f":"IF(AND(GW$5>=$L7,GW$5<=$M7),1,\"\")","v":""},"","","","","","","","","",{"$f":"IF(AND(HG$5>=$L7,HG$5<=$M7),1,\"\")","v":""},"","","","","","","","","",{"$f":"IF(AND(HQ$5>=$L7,HQ$5<=$M7),1,\"\")","v":""},"","","","","","","","","",{"$f":"IF(AND(IA$5>=$L7,IA$5<=$M7),1,\"\")","v":""},"","","","","","","","","",{"$f":"IF(AND(IK$5>=$L7,IK$5<=$M7),1,\"\")","v":""},"","","","","","","","",""]
["1.1","x","Test 1","Asterix","2016-04-12","2016-06-15",null,"I henhold til plan",{"$f":"IF(H8=\"Ferdig\",\"GRØNN\",IF(H8=\"I henhold til plan\",\"GRØNN\",IF(H8=\"Forsinket - påvirker ikke leveranse\",\"GUL\",IF(H8=\"Forsinket - påvirker leveranse\",\"RØD\",\"  \"))))","v":"GRØNN"},{"$f":"VLOOKUP(A8,Aktivitetsplan!A:X,21,FALSE)","v":0},{"$f":"VLOOKUP(A8,Aktivitetsplan!A:X,22,FALSE)","v":0},{"$f":"IF(E8=H$2,E8,E8-$O$4+1)","v":2},{"$f":"IF(F8=H$2,H$2,F8-$O$4+1)","v":66},47,{"$f":"IF(AND(O$5>=$L8,O$5<=$M8),1,\"\")","v":""},1,1,1,1,1,1,1,1,1,1,1,1,1,1,1,1,1,1,1,1,1,1,1,1,1,1,1,1,1,1,1,1,1,1,1,1,1,1,1,1,1,1,1,1,1,1,1,"","","","","","","","","","","","","","","","","","","","","","","","","","","","","","","","","","","","","","","","","","","","","","","","","","","","","","","","","","","","","","","","","","","","","","","","","","","","","","","","","","","","","","","","","","","","","","","","","","","","","","","","","","","","","","","","","","","","","","","","","","","","","","","","","","","","","","","","","","","","","","","","","","","","","","","","","","","","","","","","","","","","","","","","","","","","","","","","","","","","","","","","","","","","","","","",""]
["1.2","x","Test 2","Obelix","2016-05-30","2016-10-20",null,"I henhold til plan",{"$f":"IF(H9=\"Ferdig\",\"GRØNN\",IF(H9=\"I henhold til plan\",\"GRØNN\",IF(H9=\"Forsinket - påvirker ikke leveranse\",\"GUL\",IF(H9=\"Forsinket - påvirker leveranse\",\"RØD\",\"  \"))))","v":"GRØNN"},{"$f":"VLOOKUP(A9,Aktivitetsplan!A:X,21,FALSE)","v":0},{"$f":"VLOOKUP(A9,Aktivitetsplan!A:X,22,FALSE)","v":0},{"$f":"IF(E9=H$2,O$4,E9-$O$4+1)","v":50},{"$f":"IF(F9=H$2,H$2,F9-$O$4+1)","v":193},104,"","","","","","","","","","","","","","","","","","","","","","","","","","","","","","","","","","","",1,1,1,1,1,1,1,1,1,1,1,1,1,1,1,1,1,1,1,1,1,1,1,1,1,1,1,1,1,1,1,1,1,1,1,1,1,1,1,1,1,1,1,1,1,1,1,1,1,1,1,1,1,1,1,1,1,1,1,1,1,1,1,1,1,1,1,1,1,1,1,1,1,1,1,1,1,1,1,1,1,1,1,1,1,1,1,1,1,1,1,1,1,1,1,1,1,1,1,1,1,1,1,1,"","","","","","","","","","","","","","","","","","","","","","","","","","","","","","","","","","","","","","","","","","","","","","","","","","","","","","","","","","","","","","","","","","","","","","","","","","","","","","","","","","","","","","","","","","","","","","","","","","","","",""]
["1.3","x","Aktivitet","<Navn>",null,null,null,"Forsinket - påvirker ikke leveranse","GUL",{"$f":"VLOOKUP(A10,Aktivitetsplan!A:X,21,FALSE)","v":0},{"$f":"VLOOKUP(A10,Aktivitetsplan!A:X,22,FALSE)","v":0},{"$f":"IF(E10=F$5,H$5,E10-$O$6+1)","v":"      "},{"$f":"IF(F10=H$2,H$2,F10-$O$4+1)","v":-42470},0,"","","","","","","","","","","","","","","","","","","","","","","","","","","","","","","","","","","","","","","","","","","","","","","","","","","","","","","","","","","","","","","","","","","","","","","","","","","","","","","","","","","","","","","","","","","","","","","","","","","","","","","","","","","","","","","","","","","","","","","","","","","","","","","","","","","","","","","","","","","","","","","","","","","","","","","","","","","","","","","","","","","","","","","","","","","","","","","","","","","","","","","","","","","","","","","","","","","","","","","","","","","","","","","","","","","","","","","","","","","","","","","","","","","","","","","","","","","","","","","",""]
["1.4","x","Aktivitet","<Navn>",null,null,null,"Forsinket - påvirker leveranse","RØD",{"$f":"VLOOKUP(A11,Aktivitetsplan!A:X,21,FALSE)","v":0},{"$f":"VLOOKUP(A11,Aktivitetsplan!A:X,22,FALSE)","v":0},{"$f":"IF(E11=F$5,H$5,E11-$O$6+1)","v":"      "},{"$f":"IF(F11=H$2,H$2,F11-$O$4+1)","v":-42470},0,"","","","","","","","","","","","","","","","","","","","","","","","","","","","","","","","","","","","","","","","","","","","","","","","","","","","","","","","","","","","","","","","","","","","","","","","","","","","","","","","","","","","","","","","","","","","","","","","","","","","","","","","","","","","","","","","","","","","","","","","","","","","","","","","","","","","","","","","","","","","","","","","","","","","","","","","","","","","","","","","","","","","","","","","","","","","","","","","","","","","","","","","","","","","","","","","","","","","","","","","","","","","","","","","","","","","","","","","","","","","","","","","","","","","","","","","","","","","","","","",""]
["1.5","x","Aktivitet",null,null,null,null,null,"  ",{"$f":"VLOOKUP(A12,Aktivitetsplan!A:X,21,FALSE)","v":0},{"$f":"VLOOKUP(A12,Aktivitetsplan!A:X,22,FALSE)","v":0},"      ",{"$f":"IF(F12=F$5,F$5,F12-$O$6+1)","v":0},0,"","","","","","","","","","","","","","","","","","","","","","","","","","","","","","","","","","","","","","","","","","","","","","","","","","","","","","","","","","","","","","","","","","","","","","","","","","","","","","","","","","","","","","","","","","","","","","","","","","","","","","","","","","","","","","","","","","","","","","","","","","","","","","","","","","","","","","","","","","","","","","","","","","","","","","","","","","","","","","","","","","","","","","","","","","","","","","","","","","","","","","","","","","","","","","","","","","","","","","","","","","","","","","","","","","","","","","","","","","","","","","","","","","","","","","","","","","","","","","","",""]
["1.6","x","Aktivitet",null,null,null,null,null,"  ",{"$f":"VLOOKUP(A13,Aktivitetsplan!A:X,21,FALSE)","v":0},{"$f":"VLOOKUP(A13,Aktivitetsplan!A:X,22,FALSE)","v":0},"      ",0,0,"","","","","","","","","","","","","","","","","","","","","","","","","","","","","","","","","","","","","","","","","","","","","","","","","","","","","","","","","","","","","","","","","","","","","","","","","","","","","","","","","","","","","","","","","","","","","","","","","","","","","","","","","","","","","","","","","","","","","","","","","","","","","","","","","","","","","","","","","","","","","","","","","","","","","","","","","","","","","","","","","","","","","","","","","","","","","","","","","","","","","","","","","","","","","","","","","","","","","","","","","","","","","","","","","","","","","","","","","","","","","","","","","","","","","","","","","","","","","","","",""]
["1.7","x","Aktivitet",null,null,null,null,null,"  ",{"$f":"VLOOKUP(A14,Aktivitetsplan!A:X,21,FALSE)","v":0},{"$f":"VLOOKUP(A14,Aktivitetsplan!A:X,22,FALSE)","v":0},"      ",0,0,"","","","","","","","","","","","","","","","","","","","","","","","","","","","","","","","","","","","","","","","","","","","","","","","","","","","","","","","","","","","","","","","","","","","","","","","","","","","","","","","","","","","","","","","","","","","","","","","","","","","","","","","","","","","","","","","","","","","","","","","","","","","","","","","","","","","","","","","","","","","","","","","","","","","","","","","","","","","","","","","","","","","","","","","","","","","","","","","","","","","","","","","","","","","","","","","","","","","","","","","","","","","","","","","","","","","","","","","","","","","","","","","","","","","","","","","","","","","","","","",""]
["1.8","x","Aktivitet",null,null,null,null,null,"  ",{"$f":"VLOOKUP(A15,Aktivitetsplan!A:X,21,FALSE)","v":0},{"$f":"VLOOKUP(A15,Aktivitetsplan!A:X,22,FALSE)","v":0},"      ",0,0,"","","","","","","","","","","","","","","","","","","","","","","","","","","","","","","","","","","","","","","","","","","","","","","","","","","","","","","","","","","","","","","","","","","","","","","","","","","","","","","","","","","","","","","","","","","","","","","","","","","","","","","","","","","","","","","","","","","","","","","","","","","","","","","","","","","","","","","","","","","","","","","","","","","","","","","","","","","","","","","","","","","","","","","","","","","","","","","","","","","","","","","","","","","","","","","","","","","","","","","","","","","","","","","","","","","","","","","","","","","","","","","","","","","","","","","","","","","","","","","",""]
{"$rows_left_out":80}
{"sheet":"Aktivitetsplan","index":1,"n_rows":98,"n_cols":79,"rows_kept":98,"cut":false,"hidden":false,"merged":[]}
[null,null,null,null,null,null,null,null,null,null,null,null,null,null,null,null,null,null,null,null,"U","Utfører arbeidet"]
[null,null,"Prosjekt:","<Prosjektnavn>",null,null,null,null,null,null,null,null,null,null,null,null,null,null,null,null,"B","Hovedbeslutning"]
[null,null,"Prosjekteier:","<Prosjekteier>",null,null,null,null,null,null,null,null,null,null,null,null,null,null,null,null,"b","Delbeslutning"]
[null,null,"Prosjektleder:","<Prosjektleder>",null,null,null,null,null,null,null,null,null,null,null,null,null,null,null,null,"a","Fremdriftsansvar"]
[null,null,"Dokumenteier:","<Dokumenteier>",null,null,null,null,null,null,null,null,null,null,null,null,null,null,null,null,"R","Må rådspørres"]
[null,null,"Sist oppdatert:","<Dato>",null,null,null,null,null,null,null,null,null,null,null,null,null,null,null,null,"I","Må informeres"]
[null,null,null,null,null,null,null,null,null,null,null,null,null,null,null,null,null,null,null,null,"r","Kan tilkalles for diskusjon"]
[]
[null,null,null,null,null,null,null,null,null,null,null,null,null,null,null,null,null,null,null,null,null,null,null,null,null,"Tidsplan (uke)"]
["WBS","AKTIVITET","Navn","Navn","Navn","Navn","Navn","Navn","Navn","Navn","Navn","Navn","Navn","Navn","Navn","Navn","Navn","Navn","Navn","Navn","Estimerte timer","Tidsbruk","Gjenst.","Totalt",null,1,{"$f":"Z10+1","v":2},{"$f":"AA10+1","v":3},4,5,6,7,8,9,10,11,12,13,14,15,16,17,18,19,20,21,22,23,24,25,26,27,28,29,30,31,32,33,34,35,36,37,38,39,40,41,42,43,44,45,46,{"$f":"BS10+1","v":47},48,49,50,51,52,53,54]
[1,"Milepæl"]
["1.1","Aktivitet"]
["1.2","Aktivitet"]
["1.3","Aktivitet"]
["1.4","Aktivitet"]
{"$rows_left_out":83}